Hi,

I upgrade my project to 45.1 and I am getting the following errors: I am using VS 2013. If I target 4.0 framework it compiles fine.

Error 14 Unhandled exception (2.1.7.16, 32 bit, CLR 2.0, Release): PostSharp.Sdk.CodeModel.AssemblyLoadException: Cannot load assembly Xtensive.Orm. ============ PostSharp Assembly Loading Log =================== LOG: Finding the assembly with binding identity 'system.xml, version=4.0.0.0, culture=neutral, publickeytoken=b77a5c561934e089'. LOG: Probing location 'C:\Program Files (x86)\Reference Assemblies\Microsoft\Framework.NETFramework\v4.5.1\System.Xml.dll' because this file was explicitly added to the search path. LOG: File 'C:\Program Files (x86)\Reference Assemblies\Microsoft\Framework.NETFramework\v4.5.1\System.Xml.dll' has identity 'system.xml, version=4.0.0.0, culture=neutral, publickeytoken=b77a5c561934e089, processorarchitecture=msil'. LOG: Selecting file 'C:\Program Files (x86)\Reference Assemblies\Microsoft\Framework.NETFramework\v4.5.1\System.Xml.dll' with identity 'system.xml, version=4.0.0.0, culture=neutral, publickeytoken=b77a5c561934e089, processorarchitecture=msil'. LOG: Loading type {Xtensive.Aspects.Weaver.PlugIn, Xtensive.Aspects.Weaver}. LOG: Loading assembly {xtensive.aspects.weaver, version=0.0.0.0, culture=neutral, publickeytoken=null}. LOG: NativeDotNetPlatform.LoadAssemblyFromName: xtensive.aspects.weaver, version=0.0.0.0, culture=neutral, publickeytoken=null. LOG: Assembly 'xtensive.aspects.weaver, version=0.0.0.0, culture=neutral, publickeytoken=null' is not yet loaded in the AppDomain. LOG: Finding the assembly with binding identity 'xtensive.aspects.weaver, version=0.0.0.0, culture=neutral, publickeytoken=null'. LOG: Looking in GAC for Xtensive.Aspects.Weaver, Culture=neutral, processorArchitecture=x86. LOG: Looking in GAC for Xtensive.Aspects.Weaver, Culture=neutral, processorArchitecture=msil. LOG: Looking in GAC for Xtensive.Aspects.Weaver, Culture=neutral. LOG: Probing location 'E:\My Documents\Visual Studio 2010\Projects\DOTest2\packages\PostSharp.2.1.7.16\tools\Release\Xtensive.Aspects.Weaver.exe' because this directory was explicitly added to the search path. LOG: The file 'E:\My Documents\Visual Studio 2010\Projects\DOTest2\packages\PostSharp.2.1.7.16\tools\Release\Xtensive.Aspects.Weaver.exe' could not be found. LOG: Probing location 'E:\My Documents\Visual Studio 2010\Projects\DOTest2\packages\PostSharp.2.1.7.16\tools\Release\Xtensive.Aspects.Weaver.dll' because this directory was explicitly added to the search path. LOG: The file 'E:\My Documents\Visual Studio 2010\Projects\DOTest2\packages\PostSharp.2.1.7.16\tools\Release\Xtensive.Aspects.Weaver.dll' could not be found. LOG: Probing location 'E:\Program Develop.Net V4.51\Projects\NetString.RDFLib\Xtensive.Aspects.Weaver.exe' because this directory was explicitly added to the search path. LOG: The file 'E:\Program Develop.Net V4.51\Projects\NetString.RDFLib\Xtensive.Aspects.Weaver.exe' could not be found. LOG: Probing location 'E:\Program Develop.Net V4.51\Projects\NetString.RDFLib\Xtensive.Aspects.Weaver.dll' because this directory was explicitly added to the search path. LOG: The file 'E:\Program Develop.Net V4.51\Projects\NetString.RDFLib\Xtensive.Aspects.Weaver.dll' could not be found. LOG: Probing location 'E:\Program Develop.Net V4.51\Projects\NetString.RDFLib\bin\Debug\Xtensive.Aspects.Weaver.exe' because this directory was explicitly added to the search path. LOG: The file 'E:\Program Develop.Net V4.51\Projects\NetString.RDFLib\bin\Debug\Xtensive.Aspects.Weaver.exe' could not be found. LOG: Probing location 'E:\Program Develop.Net V4.51\Projects\NetString.RDFLib\bin\Debug\Xtensive.Aspects.Weaver.dll' because this directory was explicitly added to the search path. LOG: The file 'E:\Program Develop.Net V4.51\Projects\NetString.RDFLib\bin\Debug\Xtensive.Aspects.Weaver.dll' could not be found. LOG: Probing location 'E:\Program Develop.Net V4.51\Projects\NetString.RDFLib\obj\Debug\Xtensive.Aspects.Weaver.exe' because this directory was explicitly added to the search path. LOG: The file 'E:\Program Develop.Net V4.51\Projects\NetString.RDFLib\obj\Debug\Xtensive.Aspects.Weaver.exe' could not be found. LOG: Probing location 'E:\Program Develop.Net V4.51\Projects\NetString.RDFLib\obj\Debug\Xtensive.Aspects.Weaver.dll' because this directory was explicitly added to the search path. LOG: The file 'E:\Program Develop.Net V4.51\Projects\NetString.RDFLib\obj\Debug\Xtensive.Aspects.Weaver.dll' could not be found. LOG: Probing location 'E:\My Documents\Visual Studio 2010\Projects\DOTest2\packages\Xtensive.Orm.4.6.3\Tools\Xtensive.Aspects.Weaver.exe' because this directory was explicitly added to the search path. LOG: The file 'E:\My Documents\Visual Studio 2010\Projects\DOTest2\packages\Xtensive.Orm.4.6.3\Tools\Xtensive.Aspects.Weaver.exe' could not be found. LOG: Probing location 'E:\My Documents\Visual Studio 2010\Projects\DOTest2\packages\Xtensive.Orm.4.6.3\Tools\Xtensive.Aspects.Weaver.dll' because this directory was explicitly added to the search path. LOG: File 'E:\My Documents\Visual Studio 2010\Projects\DOTest2\packages\Xtensive.Orm.4.6.3\Tools\Xtensive.Aspects.Weaver.dll' has identity 'xtensive.aspects.weaver, version=4.6.0.0, culture=neutral, publickeytoken=93a6c53d77a5296c, processorarchitecture=msil'. LOG: Selecting file 'E:\My Documents\Visual Studio 2010\Projects\DOTest2\packages\Xtensive.Orm.4.6.3\Tools\Xtensive.Aspects.Weaver.dll' with identity 'xtensive.aspects.weaver, version=4.6.0.0, culture=neutral, publickeytoken=93a6c53d77a5296c, processorarchitecture=msil'. LOG: Invoking Assembly.Load({xtensive.aspects.weaver, version=4.6.0.0, culture=neutral, publickeytoken=93a6c53d77a5296c, processorarchitecture=msil}) LOG: (ClrHost) ProvideAssembly: "xtensive.aspects.weaver, version=4.6.0.0, culture=neutral, publickeytoken=93a6c53d77a5296c, processorarchitecture=msil". LOG: Finding the assembly with binding identity 'xtensive.aspects.weaver, version=4.6.0.0, culture=neutral, publickeytoken=93a6c53d77a5296c, processorarchitecture=msil'. LOG: Location found from cache: 'E:\My Documents\Visual Studio 2010\Projects\DOTest2\packages\Xtensive.Orm.4.6.3\Tools\Xtensive.Aspects.Weaver.dll'. LOG: (ClrHost) ProvideAssembly: "xtensive.aspects.weaver, version=4.6.0.0, culture=neutral, publickeytoken=93a6c53d77a5296c, processorarchitecture=msil": assembly found in search path. LOG: (ClrHost) ProvideAssembly: "xtensive.aspects.weaver, version=4.6.0.0, culture=neutral, publickeytoken=93a6c53d77a5296c, processorarchitecture=msil": located in "E:\My Documents\Visual Studio 2010\Projects\DOTest2\packages\Xtensive.Orm.4.6.3\Tools\Xtensive.Aspects.Weaver.dll". LOG: (ClrHost) ProvideAssembly: "xtensive.aspects.weaver, version=4.6.0.0, culture=neutral, publickeytoken=93a6c53d77a5296c, processorarchitecture=msil": returned successfully. LOG: Assembly {xtensive.aspects.weaver, version=0.0.0.0, culture=neutral, publickeytoken=null} loaded successfully. LOG: Type {Xtensive.Aspects.Weaver.PlugIn, Xtensive.Aspects.Weaver} loaded successfully. LOG: (ClrHost) ProvideAssembly: "xtensive.aspects.weaver.resources, version=4.6.0.0, culture=en-us, publickeytoken=93a6c53d77a5296c, processorarchitecture=x86". LOG: Finding the assembly with binding identity 'xtensive.aspects.weaver.resources, version=4.6.0.0, culture=en-us, publickeytoken=93a6c53d77a5296c, processorarchitecture=x86'. LOG: Looking in GAC for xtensive.aspects.weaver.resources, Version=4.6.0.0, Culture=en-US, PublicKeyToken=93a6c53d77a5296c, processorArchitecture=x86. LOG: Probing location 'E:\My Documents\Visual Studio 2010\Projects\DOTest2\packages\PostSharp.2.1.7.16\tools\Release\xtensive.aspects.weaver.resources.exe' because this directory was explicitly added to the search path. LOG: The file 'E:\My Documents\Visual Studio 2010\Projects\DOTest2\packages\PostSharp.2.1.7.16\tools\Release\xtensive.aspects.weaver.resources.exe' could not be found. LOG: Probing location 'E:\My Documents\Visual Studio 2010\Projects\DOTest2\packages\PostSharp.2.1.7.16\tools\Release\xtensive.aspects.weaver.resources.dll' because this directory was explicitly added to the search path. LOG: The file 'E:\My Documents\Visual Studio 2010\Projects\DOTest2\packages\PostSharp.2.1.7.16\tools\Release\xtensive.aspects.weaver.resources.dll' could not be found. LOG: Probing location 'E:\Program Develop.Net V4.51\Projects\NetString.RDFLib\xtensive.aspects.weaver.resources.exe' because this directory was explicitly added to the search path. LOG: The file 'E:\Program Develop.Net V4.51\Projects\NetString.RDFLib\xtensive.aspects.weaver.resources.exe' could not be found. LOG: Probing location 'E:\Program Develop.Net V4.51\Projects\NetString.RDFLib\xtensive.aspects.weaver.resources.dll' because this directory was explicitly added to the search path. LOG: The file 'E:\Program Develop.Net V4.51\Projects\NetString.RDFLib\xtensive.aspects.weaver.resources.dll' could not be found. LOG: Probing location 'E:\Program Develop.Net V4.51\Projects\NetString.RDFLib\bin\Debug\xtensive.aspects.weaver.resources.exe' because this directory was explicitly added to the search path. LOG: The file 'E:\Program Develop.Net V4.51\Projects\NetString.RDFLib\bin\Debug\xtensive.aspects.weaver.resources.exe' could not be found. LOG: Probing location 'E:\Program Develop.Net V4.51\Projects\NetString.RDFLib\bin\Debug\xtensive.aspects.weaver.resources.dll' because this directory was explicitly added to the search path. LOG: The file 'E:\Program Develop.Net V4.51\Projects\NetString.RDFLib\bin\Debug\xtensive.aspects.weaver.resources.dll' could not be found. LOG: Probing location 'E:\Program Develop.Net V4.51\Projects\NetString.RDFLib\obj\Debug\xtensive.aspects.weaver.resources.exe' because this directory was explicitly added to the search path. LOG: The file 'E:\Program Develop.Net V4.51\Projects\NetString.RDFLib\obj\Debug\xtensive.aspects.weaver.resources.exe' could not be found. LOG: Probing location 'E:\Program Develop.Net V4.51\Projects\NetString.RDFLib\obj\Debug\xtensive.aspects.weaver.resources.dll' because this directory was explicitly added to the search path. LOG: The file 'E:\Program Develop.Net V4.51\Projects\NetString.RDFLib\obj\Debug\xtensive.aspects.weaver.resources.dll' could not be found. LOG: Probing location 'E:\My Documents\Visual Studio 2010\Projects\DOTest2\packages\Xtensive.Orm.4.6.3\Tools\xtensive.aspects.weaver.resources.exe' because this directory was explicitly added to the search path. LOG: The file 'E:\My Documents\Visual Studio 2010\Projects\DOTest2\packages\Xtensive.Orm.4.6.3\Tools\xtensive.aspects.weaver.resources.exe' could not be found. LOG: Probing location 'E:\My Documents\Visual Studio 2010\Projects\DOTest2\packages\Xtensive.Orm.4.6.3\Tools\xtensive.aspects.weaver.resources.dll' because this directory was explicitly added to the search path. LOG: The file 'E:\My Documents\Visual Studio 2010\Projects\DOTest2\packages\Xtensive.Orm.4.6.3\Tools\xtensive.aspects.weaver.resources.dll' could not be found. LOG: Probing location 'C:\Program Files (x86)\Reference Assemblies\Microsoft\Framework.NETFramework\v4.5.1\xtensive.aspects.weaver.resources.exe' because this directory was explicitly added to the search path. LOG: The file 'C:\Program Files (x86)\Reference Assemblies\Microsoft\Framework.NETFramework\v4.5.1\xtensive.aspects.weaver.resources.exe' could not be found. LOG: Probing location 'C:\Program Files (x86)\Reference Assemblies\Microsoft\Framework.NETFramework\v4.5.1\xtensive.aspects.weaver.resources.dll' because this directory was explicitly added to the search path. LOG: The file 'C:\Program Files (x86)\Reference Assemblies\Microsoft\Framework.NETFramework\v4.5.1\xtensive.aspects.weaver.resources.dll' could not be found. LOG: Probing location 'C:\Program Files (x86)\Reference Assemblies\Microsoft\Framework.NETFramework\v4.5.1\Facades\xtensive.aspects.weaver.resources.exe' because this directory was explicitly added to the search path. LOG: The file 'C:\Program Files (x86)\Reference Assemblies\Microsoft\Framework.NETFramework\v4.5.1\Facades\xtensive.aspects.weaver.resources.exe' could not be found. LOG: Probing location 'C:\Program Files (x86)\Reference Assemblies\Microsoft\Framework.NETFramework\v4.5.1\Facades\xtensive.aspects.weaver.resources.dll' because this directory was explicitly added to the search path. LOG: The file 'C:\Program Files (x86)\Reference Assemblies\Microsoft\Framework.NETFramework\v4.5.1\Facades\xtensive.aspects.weaver.resources.dll' could not be found. LOG: The assembly 'xtensive.aspects.weaver.resources, version=4.6.0.0, culture=en-us, publickeytoken=93a6c53d77a5296c, processorarchitecture=x86' was not found. LOG: (ClrHost) ProvideAssembly: "xtensive.aspects.weaver.resources, version=4.6.0.0, culture=en-us, publickeytoken=93a6c53d77a5296c, processorarchitecture=x86": file not found! LOG: (ClrHost) ProvideAssembly: "xtensive.aspects.weaver.resources, version=4.6.0.0, culture=en-us, publickeytoken=93a6c53d77a5296c, processorarchitecture=msil". LOG: Finding the assembly with binding identity 'xtensive.aspects.weaver.resources, version=4.6.0.0, culture=en-us, publickeytoken=93a6c53d77a5296c, processorarchitecture=msil'. LOG: Looking in GAC for xtensive.aspects.weaver.resources, Version=4.6.0.0, Culture=en-US, PublicKeyToken=93a6c53d77a5296c, processorArchitecture=msil. LOG: Probing location 'E:\My Documents\Visual Studio 2010\Projects\DOTest2\packages\PostSharp.2.1.7.16\tools\Release\xtensive.aspects.weaver.resources.exe' because this directory was explicitly added to the search path. LOG: The file 'E:\My Documents\Visual Studio 2010\Projects\DOTest2\packages\PostSharp.2.1.7.16\tools\Release\xtensive.aspects.weaver.resources.exe' could not be found. LOG: Probing location 'E:\My Documents\Visual Studio 2010\Projects\DOTest2\packages\PostSharp.2.1.7.16\tools\Release\xtensive.aspects.weaver.resources.dll' because this directory was explicitly added to the search path. LOG: The file 'E:\My Documents\Visual Studio 2010\Projects\DOTest2\packages\PostSharp.2.1.7.16\tools\Release\xtensive.aspects.weaver.resources.dll' could not be found. LOG: Probing location 'E:\Program Develop.Net V4.51\Projects\NetString.RDFLib\xtensive.aspects.weaver.resources.exe' because this directory was explicitly added to the search path. LOG: The file 'E:\Program Develop.Net V4.51\Projects\NetString.RDFLib\xtensive.aspects.weaver.resources.exe' could not be found. LOG: Probing location 'E:\Program Develop.Net V4.51\Projects\NetString.RDFLib\xtensive.aspects.weaver.resources.dll' because this directory was explicitly added to the search path. LOG: The file 'E:\Program Develop.Net V4.51\Projects\NetString.RDFLib\xtensive.aspects.weaver.resources.dll' could not be found. LOG: Probing location 'E:\Program Develop.Net V4.51\Projects\NetString.RDFLib\bin\Debug\xtensive.aspects.weaver.resources.exe' because this directory was explicitly added to the search path. LOG: The file 'E:\Program Develop.Net V4.51\Projects\NetString.RDFLib\bin\Debug\xtensive.aspects.weaver.resources.exe' could not be found. LOG: Probing location 'E:\Program Develop.Net V4.51\Projects\NetString.RDFLib\bin\Debug\xtensive.aspects.weaver.resources.dll' because this directory was explicitly added to the search path. LOG: The file 'E:\Program Develop.Net V4.51\Projects\NetString.RDFLib\bin\Debug\xtensive.aspects.weaver.resources.dll' could not be found. LOG: Probing location 'E:\Program Develop.Net V4.51\Projects\NetString.RDFLib\obj\Debug\xtensive.aspects.weaver.resources.exe' because this directory was explicitly added to the search path. LOG: The file 'E:\Program Develop.Net V4.51\Projects\NetString.RDFLib\obj\Debug\xtensive.aspects.weaver.resources.exe' could not be found. LOG: Probing location 'E:\Program Develop.Net V4.51\Projects\NetString.RDFLib\obj\Debug\xtensive.aspects.weaver.resources.dll' because this directory was explicitly added to the search path. LOG: The file 'E:\Program Develop.Net V4.51\Projects\NetString.RDFLib\obj\Debug\xtensive.aspects.weaver.resources.dll' could not be found. LOG: Probing location 'E:\My Documents\Visual Studio 2010\Projects\DOTest2\packages\Xtensive.Orm.4.6.3\Tools\xtensive.aspects.weaver.resources.exe' because this directory was explicitly added to the search path. LOG: The file 'E:\My Documents\Visual Studio 2010\Projects\DOTest2\packages\Xtensive.Orm.4.6.3\Tools\xtensive.aspects.weaver.resources.exe' could not be found. LOG: Probing location 'E:\My Documents\Visual Studio 2010\Projects\DOTest2\packages\Xtensive.Orm.4.6.3\Tools\xtensive.aspects.weaver.resources.dll' because this directory was explicitly added to the search path. LOG: The file 'E:\My Documents\Visual Studio 2010\Projects\DOTest2\packages\Xtensive.Orm.4.6.3\Tools\xtensive.aspects.weaver.resources.dll' could not be found. LOG: Probing location 'C:\Program Files (x86)\Reference Assemblies\Microsoft\Framework.NETFramework\v4.5.1\xtensive.aspects.weaver.resources.exe' because this directory was explicitly added to the search path. LOG: The file 'C:\Program Files (x86)\Reference Assemblies\Microsoft\Framework.NETFramework\v4.5.1\xtensive.aspects.weaver.resources.exe' could not be found. LOG: Probing location 'C:\Program Files (x86)\Reference Assemblies\Microsoft\Framework.NETFramework\v4.5.1\xtensive.aspects.weaver.resources.dll' because this directory was explicitly added to the search path. LOG: The file 'C:\Program Files (x86)\Reference Assemblies\Microsoft\Framework.NETFramework\v4.5.1\xtensive.aspects.weaver.resources.dll' could not be found. LOG: Probing location 'C:\Program Files (x86)\Reference Assemblies\Microsoft\Framework.NETFramework\v4.5.1\Facades\xtensive.aspects.weaver.resources.exe' because this directory was explicitly added to the search path. LOG: The file 'C:\Program Files (x86)\Reference Assemblies\Microsoft\Framework.NETFramework\v4.5.1\Facades\xtensive.aspects.weaver.resources.exe' could not be found. LOG: Probing location 'C:\Program Files (x86)\Reference Assemblies\Microsoft\Framework.NETFramework\v4.5.1\Facades\xtensive.aspects.weaver.resources.dll' because this directory was explicitly added to the search path. LOG: The file 'C:\Program Files (x86)\Reference Assemblies\Microsoft\Framework.NETFramework\v4.5.1\Facades\xtensive.aspects.weaver.resources.dll' could not be found. LOG: The assembly 'xtensive.aspects.weaver.resources, version=4.6.0.0, culture=en-us, publickeytoken=93a6c53d77a5296c, processorarchitecture=msil' was not found. LOG: (ClrHost) ProvideAssembly: "xtensive.aspects.weaver.resources, version=4.6.0.0, culture=en-us, publickeytoken=93a6c53d77a5296c, processorarchitecture=msil": file not found! LOG: (ClrHost) ProvideAssembly: "xtensive.aspects.weaver.resources, version=4.6.0.0, culture=en-us, publickeytoken=93a6c53d77a5296c". LOG: Finding the assembly with binding identity 'xtensive.aspects.weaver.resources, version=4.6.0.0, culture=en-us, publickeytoken=93a6c53d77a5296c'. LOG: Looking in GAC for xtensive.aspects.weaver.resources, Version=4.6.0.0, Culture=en-US, PublicKeyToken=93a6c53d77a5296c, processorArchitecture=x86. LOG: Looking in GAC for xtensive.aspects.weaver.resources, Version=4.6.0.0, Culture=en-US, PublicKeyToken=93a6c53d77a5296c, processorArchitecture=msil. LOG: Looking in GAC for xtensive.aspects.weaver.resources, Version=4.6.0.0, Culture=en-US, PublicKeyToken=93a6c53d77a5296c. LOG: Probing location 'E:\My Documents\Visual Studio 2010\Projects\DOTest2\packages\PostSharp.2.1.7.16\tools\Release\xtensive.aspects.weaver.resources.exe' because this directory was explicitly added to the search path. LOG: The file 'E:\My Documents\Visual Studio 2010\Projects\DOTest2\packages\PostSharp.2.1.7.16\tools\Release\xtensive.aspects.weaver.resources.exe' could not be found. LOG: Probing location 'E:\My Documents\Visual Studio 2010\Projects\DOTest2\packages\PostSharp.2.1.7.16\tools\Release\xtensive.aspects.weaver.resources.dll' because this directory was explicitly added to the search path. LOG: The file 'E:\My Documents\Visual Studio 2010\Projects\DOTest2\packages\PostSharp.2.1.7.16\tools\Release\xtensive.aspects.weaver.resources.dll' could not be found. LOG: Probing location 'E:\Program Develop.Net V4.51\Projects\NetString.RDFLib\xtensive.aspects.weaver.resources.exe' because this directory was explicitly added to the search path. LOG: The file 'E:\Program Develop.Net V4.51\Projects\NetString.RDFLib\xtensive.aspects.weaver.resources.exe' could not be found. LOG: Probing location 'E:\Program Develop.Net V4.51\Projects\NetString.RDFLib\xtensive.aspects.weaver.resources.dll' because this directory was explicitly added to the search path. LOG: The file 'E:\Program Develop.Net V4.51\Projects\NetString.RDFLib\xtensive.aspects.weaver.resources.dll' could not be found. LOG: Probing location 'E:\Program Develop.Net V4.51\Projects\NetString.RDFLib\bin\Debug\xtensive.aspects.weaver.resources.exe' because this directory was explicitly added to the search path. LOG: The file 'E:\Program Develop.Net V4.51\Projects\NetString.RDFLib\bin\Debug\xtensive.aspects.weaver.resources.exe' could not be found. LOG: Probing location 'E:\Program Develop.Net V4.51\Projects\NetString.RDFLib\bin\Debug\xtensive.aspects.weaver.resources.dll' because this directory was explicitly added to the search path. LOG: The file 'E:\Program Develop.Net V4.51\Projects\NetString.RDFLib\bin\Debug\xtensive.aspects.weaver.resources.dll' could not be found. LOG: Probing location 'E:\Program Develop.Net V4.51\Projects\NetString.RDFLib\obj\Debug\xtensive.aspects.weaver.resources.exe' because this directory was explicitly added to the search path. LOG: The file 'E:\Program Develop.Net V4.51\Projects\NetString.RDFLib\obj\Debug\xtensive.aspects.weaver.resources.exe' could not be found. LOG: Probing location 'E:\Program Develop.Net V4.51\Projects\NetString.RDFLib\obj\Debug\xtensive.aspects.weaver.resources.dll' because this directory was explicitly added to the search path. LOG: The file 'E:\Program Develop.Net V4.51\Projects\NetString.RDFLib\obj\Debug\xtensive.aspects.weaver.resources.dll' could not be found. LOG: Probing location 'E:\My Documents\Visual Studio 2010\Projects\DOTest2\packages\Xtensive.Orm.4.6.3\Tools\xtensive.aspects.weaver.resources.exe' because this directory was explicitly added to the search path. LOG: The file 'E:\My Documents\Visual Studio 2010\Projects\DOTest2\packages\Xtensive.Orm.4.6.3\Tools\xtensive.aspects.weaver.resources.exe' could not be found. LOG: Probing location 'E:\My Documents\Visual Studio 2010\Projects\DOTest2\packages\Xtensive.Orm.4.6.3\Tools\xtensive.aspects.weaver.resources.dll' because this directory was explicitly added to the search path. LOG: The file 'E:\My Documents\Visual Studio 2010\Projects\DOTest2\packages\Xtensive.Orm.4.6.3\Tools\xtensive.aspects.weaver.resources.dll' could not be found. LOG: Probing location 'C:\Program Files (x86)\Reference Assemblies\Microsoft\Framework.NETFramework\v4.5.1\xtensive.aspects.weaver.resources.exe' because this directory was explicitly added to the search path. LOG: The file 'C:\Program Files (x86)\Reference Assemblies\Microsoft\Framework.NETFramework\v4.5.1\xtensive.aspects.weaver.resources.exe' could not be found. LOG: Probing location 'C:\Program Files (x86)\Reference Assemblies\Microsoft\Framework.NETFramework\v4.5.1\xtensive.aspects.weaver.resources.dll' because this directory was explicitly added to the search path. LOG: The file 'C:\Program Files (x86)\Reference Assemblies\Microsoft\Framework.NETFramework\v4.5.1\xtensive.aspects.weaver.resources.dll' could not be found. LOG: Probing location 'C:\Program Files (x86)\Reference Assemblies\Microsoft\Framework.NETFramework\v4.5.1\Facades\xtensive.aspects.weaver.resources.exe' because this directory was explicitly added to the search path. LOG: The file 'C:\Program Files (x86)\Reference Assemblies\Microsoft\Framework.NETFramework\v4.5.1\Facades\xtensive.aspects.weaver.resources.exe' could not be found. LOG: Probing location 'C:\Program Files (x86)\Reference Assemblies\Microsoft\Framework.NETFramework\v4.5.1\Facades\xtensive.aspects.weaver.resources.dll' because this directory was explicitly added to the search path. LOG: The file 'C:\Program Files (x86)\Reference Assemblies\Microsoft\Framework.NETFramework\v4.5.1\Facades\xtensive.aspects.weaver.resources.dll' could not be found. LOG: The assembly 'xtensive.aspects.weaver.resources, version=4.6.0.0, culture=en-us, publickeytoken=93a6c53d77a5296c' was not found. LOG: (ClrHost) ProvideAssembly: "xtensive.aspects.weaver.resources, version=4.6.0.0, culture=en-us, publickeytoken=93a6c53d77a5296c": file not found! LOG: (ClrHost) ProvideAssembly: "xtensive.aspects.weaver.resources, version=4.6.0.0, culture=en, publickeytoken=93a6c53d77a5296c, processorarchitecture=x86". LOG: Finding the assembly with binding identity 'xtensive.aspects.weaver.resources, version=4.6.0.0, culture=en, publickeytoken=93a6c53d77a5296c, processorarchitecture=x86'. LOG: Looking in GAC for xtensive.aspects.weaver.resources, Version=4.6.0.0, Culture=en, PublicKeyToken=93a6c53d77a5296c, processorArchitecture=x86. LOG: Probing location 'E:\My Documents\Visual Studio 2010\Projects\DOTest2\packages\PostSharp.2.1.7.16\tools\Release\xtensive.aspects.weaver.resources.exe' because this directory was explicitly added to the search path. LOG: The file 'E:\My Documents\Visual Studio 2010\Projects\DOTest2\packages\PostSharp.2.1.7.16\tools\Release\xtensive.aspects.weaver.resources.exe' could not be found. LOG: Probing location 'E:\My Documents\Visual Studio 2010\Projects\DOTest2\packages\PostSharp.2.1.7.16\tools\Release\xtensive.aspects.weaver.resources.dll' because this directory was explicitly added to the search path. LOG: The file 'E:\My Documents\Visual Studio 2010\Projects\DOTest2\packages\PostSharp.2.1.7.16\tools\Release\xtensive.aspects.weaver.resources.dll' could not be found. LOG: Probing location 'E:\Program Develop.Net V4.51\Projects\NetString.RDFLib\xtensive.aspects.weaver.resources.exe' because this directory was explicitly added to the search path. LOG: The file 'E:\Program Develop.Net V4.51\Projects\NetString.RDFLib\xtensive.aspects.weaver.resources.exe' could not be found. LOG: Probing location 'E:\Program Develop.Net V4.51\Projects\NetString.RDFLib\xtensive.aspects.weaver.resources.dll' because this directory was explicitly added to the search path. LOG: The file 'E:\Program Develop.Net V4.51\Projects\NetString.RDFLib\xtensive.aspects.weaver.resources.dll' could not be found. LOG: Probing location 'E:\Program Develop.Net V4.51\Projects\NetString.RDFLib\bin\Debug\xtensive.aspects.weaver.resources.exe' because this directory was explicitly added to the search path. LOG: The file 'E:\Program Develop.Net V4.51\Projects\NetString.RDFLib\bin\Debug\xtensive.aspects.weaver.resources.exe' could not be found. LOG: Probing location 'E:\Program Develop.Net V4.51\Projects\NetString.RDFLib\bin\Debug\xtensive.aspects.weaver.resources.dll' because this directory was explicitly added to the search path. LOG: The file 'E:\Program Develop.Net V4.51\Projects\NetString.RDFLib\bin\Debug\xtensive.aspects.weaver.resources.dll' could not be found. LOG: Probing location 'E:\Program Develop.Net V4.51\Projects\NetString.RDFLib\obj\Debug\xtensive.aspects.weaver.resources.exe' because this directory was explicitly added to the search path. LOG: The file 'E:\Program Develop.Net V4.51\Projects\NetString.RDFLib\obj\Debug\xtensive.aspects.weaver.resources.exe' could not be found. LOG: Probing location 'E:\Program Develop.Net V4.51\Projects\NetString.RDFLib\obj\Debug\xtensive.aspects.weaver.resources.dll' because this directory was explicitly added to the search path. LOG: The file 'E:\Program Develop.Net V4.51\Projects\NetString.RDFLib\obj\Debug\xtensive.aspects.weaver.resources.dll' could not be found. LOG: Probing location 'E:\My Documents\Visual Studio 2010\Projects\DOTest2\packages\Xtensive.Orm.4.6.3\Tools\xtensive.aspects.weaver.resources.exe' because this directory was explicitly added to the search path. LOG: The file 'E:\My Documents\Visual Studio 2010\Projects\DOTest2\packages\Xtensive.Orm.4.6.3\Tools\xtensive.aspects.weaver.resources.exe' could not be found. LOG: Probing location 'E:\My Documents\Visual Studio 2010\Projects\DOTest2\packages\Xtensive.Orm.4.6.3\Tools\xtensive.aspects.weaver.resources.dll' because this directory was explicitly added to the search path. LOG: The file 'E:\My Documents\Visual Studio 2010\Projects\DOTest2\packages\Xtensive.Orm.4.6.3\Tools\xtensive.aspects.weaver.resources.dll' could not be found. LOG: Probing location 'C:\Program Files (x86)\Reference Assemblies\Microsoft\Framework.NETFramework\v4.5.1\xtensive.aspects.weaver.resources.exe' because this directory was explicitly added to the search path. LOG: The file 'C:\Program Files (x86)\Reference Assemblies\Microsoft\Framework.NETFramework\v4.5.1\xtensive.aspects.weaver.resources.exe' could not be found. LOG: Probing location 'C:\Program Files (x86)\Reference Assemblies\Microsoft\Framework.NETFramework\v4.5.1\xtensive.aspects.weaver.resources.dll' because this directory was explicitly added to the search path. LOG: The file 'C:\Program Files (x86)\Reference Assemblies\Microsoft\Framework.NETFramework\v4.5.1\xtensive.aspects.weaver.resources.dll' could not be found. LOG: Probing location 'C:\Program Files (x86)\Reference Assemblies\Microsoft\Framework.NETFramework\v4.5.1\Facades\xtensive.aspects.weaver.resources.exe' because this directory was explicitly added to the search path. LOG: The file 'C:\Program Files (x86)\Reference Assemblies\Microsoft\Framework.NETFramework\v4.5.1\Facades\xtensive.aspects.weaver.resources.exe' could not be found. LOG: Probing location 'C:\Program Files (x86)\Reference Assemblies\Microsoft\Framework.NETFramework\v4.5.1\Facades\xtensive.aspects.weaver.resources.dll' because this directory was explicitly added to the search path. LOG: The file 'C:\Program Files (x86)\Reference Assemblies\Microsoft\Framework.NETFramework\v4.5.1\Facades\xtensive.aspects.weaver.resources.dll' could not be found. LOG: The assembly 'xtensive.aspects.weaver.resources, version=4.6.0.0, culture=en, publickeytoken=93a6c53d77a5296c, processorarchitecture=x86' was not found. LOG: (ClrHost) ProvideAssembly: "xtensive.aspects.weaver.resources, version=4.6.0.0, culture=en, publickeytoken=93a6c53d77a5296c, processorarchitecture=x86": file not found! LOG: (ClrHost) ProvideAssembly: "xtensive.aspects.weaver.resources, version=4.6.0.0, culture=en, publickeytoken=93a6c53d77a5296c, processorarchitecture=msil". LOG: Finding the assembly with binding identity 'xtensive.aspects.weaver.resources, version=4.6.0.0, culture=en, publickeytoken=93a6c53d77a5296c, processorarchitecture=msil'. LOG: Looking in GAC for xtensive.aspects.weaver.resources, Version=4.6.0.0, Culture=en, PublicKeyToken=93a6c53d77a5296c, processorArchitecture=msil. LOG: Probing location 'E:\My Documents\Visual Studio 2010\Projects\DOTest2\packages\PostSharp.2.1.7.16\tools\Release\xtensive.aspects.weaver.resources.exe' because this directory was explicitly added to the search path. LOG: The file 'E:\My Documents\Visual Studio 2010\Projects\DOTest2\packages\PostSharp.2.1.7.16\tools\Release\xtensive.aspects.weaver.resources.exe' could not be found. LOG: Probing location 'E:\My Documents\Visual Studio 2010\Projects\DOTest2\packages\PostSharp.2.1.7.16\tools\Release\xtensive.aspects.weaver.resources.dll' because this directory was explicitly added to the search path. LOG: The file 'E:\My Documents\Visual Studio 2010\Projects\DOTest2\packages\PostSharp.2.1.7.16\tools\Release\xtensive.aspects.weaver.resources.dll' could not be found. LOG: Probing location 'E:\Program Develop.Net V4.51\Projects\NetString.RDFLib\xtensive.aspects.weaver.resources.exe' because this directory was explicitly added to the search path. LOG: The file 'E:\Program Develop.Net V4.51\Projects\NetString.RDFLib\xtensive.aspects.weaver.resources.exe' could not be found. LOG: Probing location 'E:\Program Develop.Net V4.51\Projects\NetString.RDFLib\xtensive.aspects.weaver.resources.dll' because this directory was explicitly added to the search path. LOG: The file 'E:\Program Develop.Net V4.51\Projects\NetString.RDFLib\xtensive.aspects.weaver.resources.dll' could not be found. LOG: Probing location 'E:\Program Develop.Net V4.51\Projects\NetString.RDFLib\bin\Debug\xtensive.aspects.weaver.resources.exe' because this directory was explicitly added to the search path. LOG: The file 'E:\Program Develop.Net V4.51\Projects\NetString.RDFLib\bin\Debug\xtensive.aspects.weaver.resources.exe' could not be found. LOG: Probing location 'E:\Program Develop.Net V4.51\Projects\NetString.RDFLib\bin\Debug\xtensive.aspects.weaver.resources.dll' because this directory was explicitly added to the search path. LOG: The file 'E:\Program Develop.Net V4.51\Projects\NetString.RDFLib\bin\Debug\xtensive.aspects.weaver.resources.dll' could not be found. LOG: Probing location 'E:\Program Develop.Net V4.51\Projects\NetString.RDFLib\obj\Debug\xtensive.aspects.weaver.resources.exe' because this directory was explicitly added to the search path. LOG: The file 'E:\Program Develop.Net V4.51\Projects\NetString.RDFLib\obj\Debug\xtensive.aspects.weaver.resources.exe' could not be found. LOG: Probing location 'E:\Program Develop.Net V4.51\Projects\NetString.RDFLib\obj\Debug\xtensive.aspects.weaver.resources.dll' because this directory was explicitly added to the search path. LOG: The file 'E:\Program Develop.Net V4.51\Projects\NetString.RDFLib\obj\Debug\xtensive.aspects.weaver.resources.dll' could not be found. LOG: Probing location 'E:\My Documents\Visual Studio 2010\Projects\DOTest2\packages\Xtensive.Orm.4.6.3\Tools\xtensive.aspects.weaver.resources.exe' because this directory was explicitly added to the search path. LOG: The file 'E:\My Documents\Visual Studio 2010\Projects\DOTest2\packages\Xtensive.Orm.4.6.3\Tools\xtensive.aspects.weaver.resources.exe' could not be found. LOG: Probing location 'E:\My Documents\Visual Studio 2010\Projects\DOTest2\packages\Xtensive.Orm.4.6.3\Tools\xtensive.aspects.weaver.resources.dll' because this directory was explicitly added to the search path. LOG: The file 'E:\My Documents\Visual Studio 2010\Projects\DOTest2\packages\Xtensive.Orm.4.6.3\Tools\xtensive.aspects.weaver.resources.dll' could not be found. LOG: Probing location 'C:\Program Files (x86)\Reference Assemblies\Microsoft\Framework.NETFramework\v4.5.1\xtensive.aspects.weaver.resources.exe' because this directory was explicitly added to the search path. LOG: The file 'C:\Program Files (x86)\Reference Assemblies\Microsoft\Framework.NETFramework\v4.5.1\xtensive.aspects.weaver.resources.exe' could not be found. LOG: Probing location 'C:\Program Files (x86)\Reference Assemblies\Microsoft\Framework.NETFramework\v4.5.1\xtensive.aspects.weaver.resources.dll' because this directory was explicitly added to the search path. LOG: The file 'C:\Program Files (x86)\Reference Assemblies\Microsoft\Framework.NETFramework\v4.5.1\xtensive.aspects.weaver.resources.dll' could not be found. LOG: Probing location 'C:\Program Files (x86)\Reference Assemblies\Microsoft\Framework.NETFramework\v4.5.1\Facades\xtensive.aspects.weaver.resources.exe' because this directory was explicitly added to the search path. LOG: The file 'C:\Program Files (x86)\Reference Assemblies\Microsoft\Framework.NETFramework\v4.5.1\Facades\xtensive.aspects.weaver.resources.exe' could not be found. LOG: Probing location 'C:\Program Files (x86)\Reference Assemblies\Microsoft\Framework.NETFramework\v4.5.1\Facades\xtensive.aspects.weaver.resources.dll' because this directory was explicitly added to the search path. LOG: The file 'C:\Program Files (x86)\Reference Assemblies\Microsoft\Framework.NETFramework\v4.5.1\Facades\xtensive.aspects.weaver.resources.dll' could not be found. LOG: The assembly 'xtensive.aspects.weaver.resources, version=4.6.0.0, culture=en, publickeytoken=93a6c53d77a5296c, processorarchitecture=msil' was not found. LOG: (ClrHost) ProvideAssembly: "xtensive.aspects.weaver.resources, version=4.6.0.0, culture=en, publickeytoken=93a6c53d77a5296c, processorarchitecture=msil": file not found! LOG: (ClrHost) ProvideAssembly: "xtensive.aspects.weaver.resources, version=4.6.0.0, culture=en, publickeytoken=93a6c53d77a5296c". LOG: Finding the assembly with binding identity 'xtensive.aspects.weaver.resources, version=4.6.0.0, culture=en, publickeytoken=93a6c53d77a5296c'. LOG: Looking in GAC for xtensive.aspects.weaver.resources, Version=4.6.0.0, Culture=en, PublicKeyToken=93a6c53d77a5296c, processorArchitecture=x86. LOG: Looking in GAC for xtensive.aspects.weaver.resources, Version=4.6.0.0, Culture=en, PublicKeyToken=93a6c53d77a5296c, processorArchitecture=msil. LOG: Looking in GAC for xtensive.aspects.weaver.resources, Version=4.6.0.0, Culture=en, PublicKeyToken=93a6c53d77a5296c. LOG: Probing location 'E:\My Documents\Visual Studio 2010\Projects\DOTest2\packages\PostSharp.2.1.7.16\tools\Release\xtensive.aspects.weaver.resources.exe' because this directory was explicitly added to the search path. LOG: The file 'E:\My Documents\Visual Studio 2010\Projects\DOTest2\packages\PostSharp.2.1.7.16\tools\Release\xtensive.aspects.weaver.resources.exe' could not be found. LOG: Probing location 'E:\My Documents\Visual Studio 2010\Projects\DOTest2\packages\PostSharp.2.1.7.16\tools\Release\xtensive.aspects.weaver.resources.dll' because this directory was explicitly added to the search path. LOG: The file 'E:\My Documents\Visual Studio 2010\Projects\DOTest2\packages\PostSharp.2.1.7.16\tools\Release\xtensive.aspects.weaver.resources.dll' could not be found. LOG: Probing location 'E:\Program Develop.Net V4.51\Projects\NetString.RDFLib\xtensive.aspects.weaver.resources.exe' because this directory was explicitly added to the search path. LOG: The file 'E:\Program Develop.Net V4.51\Projects\NetString.RDFLib\xtensive.aspects.weaver.resources.exe' could not be found. LOG: Probing location 'E:\Program Develop.Net V4.51\Projects\NetString.RDFLib\xtensive.aspects.weaver.resources.dll' because this directory was explicitly added to the search path. LOG: The file 'E:\Program Develop.Net V4.51\Projects\NetString.RDFLib\xtensive.aspects.weaver.resources.dll' could not be found. LOG: Probing location 'E:\Program Develop.Net V4.51\Projects\NetString.RDFLib\bin\Debug\xtensive.aspects.weaver.resources.exe' because this directory was explicitly added to the search path. LOG: The file 'E:\Program Develop.Net V4.51\Projects\NetString.RDFLib\bin\Debug\xtensive.aspects.weaver.resources.exe' could not be found. LOG: Probing location 'E:\Program Develop.Net V4.51\Projects\NetString.RDFLib\bin\Debug\xtensive.aspects.weaver.resources.dll' because this directory was explicitly added to the search path. LOG: The file 'E:\Program Develop.Net V4.51\Projects\NetString.RDFLib\bin\Debug\xtensive.aspects.weaver.resources.dll' could not be found. LOG: Probing location 'E:\Program Develop.Net V4.51\Projects\NetString.RDFLib\obj\Debug\xtensive.aspects.weaver.resources.exe' because this directory was explicitly added to the search path. LOG: The file 'E:\Program Develop.Net V4.51\Projects\NetString.RDFLib\obj\Debug\xtensive.aspects.weaver.resources.exe' could not be found. LOG: Probing location 'E:\Program Develop.Net V4.51\Projects\NetString.RDFLib\obj\Debug\xtensive.aspects.weaver.resources.dll' because this directory was explicitly added to the search path. LOG: The file 'E:\Program Develop.Net V4.51\Projects\NetString.RDFLib\obj\Debug\xtensive.aspects.weaver.resources.dll' could not be found. LOG: Probing location 'E:\My Documents\Visual Studio 2010\Projects\DOTest2\packages\Xtensive.Orm.4.6.3\Tools\xtensive.aspects.weaver.resources.exe' because this directory was explicitly added to the search path. LOG: The file 'E:\My Documents\Visual Studio 2010\Projects\DOTest2\packages\Xtensive.Orm.4.6.3\Tools\xtensive.aspects.weaver.resources.exe' could not be found. LOG: Probing location 'E:\My Documents\Visual Studio 2010\Projects\DOTest2\packages\Xtensive.Orm.4.6.3\Tools\xtensive.aspects.weaver.resources.dll' because this directory was explicitly added to the search path. LOG: The file 'E:\My Documents\Visual Studio 2010\Projects\DOTest2\packages\Xtensive.Orm.4.6.3\Tools\xtensive.aspects.weaver.resources.dll' could not be found. LOG: Probing location 'C:\Program Files (x86)\Reference Assemblies\Microsoft\Framework.NETFramework\v4.5.1\xtensive.aspects.weaver.resources.exe' because this directory was explicitly added to the search path. LOG: The file 'C:\Program Files (x86)\Reference Assemblies\Microsoft\Framework.NETFramework\v4.5.1\xtensive.aspects.weaver.resources.exe' could not be found. LOG: Probing location 'C:\Program Files (x86)\Reference Assemblies\Microsoft\Framework.NETFramework\v4.5.1\xtensive.aspects.weaver.resources.dll' because this directory was explicitly added to the search path. LOG: The file 'C:\Program Files (x86)\Reference Assemblies\Microsoft\Framework.NETFramework\v4.5.1\xtensive.aspects.weaver.resources.dll' could not be found. LOG: Probing location 'C:\Program Files (x86)\Reference Assemblies\Microsoft\Framework.NETFramework\v4.5.1\Facades\xtensive.aspects.weaver.resources.exe' because this directory was explicitly added to the search path. LOG: The file 'C:\Program Files (x86)\Reference Assemblies\Microsoft\Framework.NETFramework\v4.5.1\Facades\xtensive.aspects.weaver.resources.exe' could not be found. LOG: Probing location 'C:\Program Files (x86)\Reference Assemblies\Microsoft\Framework.NETFramework\v4.5.1\Facades\xtensive.aspects.weaver.resources.dll' because this directory was explicitly added to the search path. LOG: The file 'C:\Program Files (x86)\Reference Assemblies\Microsoft\Framework.NETFramework\v4.5.1\Facades\xtensive.aspects.weaver.resources.dll' could not be found. LOG: The assembly 'xtensive.aspects.weaver.resources, version=4.6.0.0, culture=en, publickeytoken=93a6c53d77a5296c' was not found. LOG: (ClrHost) ProvideAssembly: "xtensive.aspects.weaver.resources, version=4.6.0.0, culture=en, publickeytoken=93a6c53d77a5296c": file not found! LOG: (ClrHost) ProvideAssembly: "xtensive.aspects, version=4.6.0.0, culture=neutral, publickeytoken=93a6c53d77a5296c, processorarchitecture=x86". LOG: Finding the assembly with binding identity 'xtensive.aspects, version=4.6.0.0, culture=neutral, publickeytoken=93a6c53d77a5296c, processorarchitecture=x86'. LOG: Looking in GAC for xtensive.aspects, Version=4.6.0.0, Culture=neutral, PublicKeyToken=93a6c53d77a5296c, processorArchitecture=x86. LOG: Probing location 'E:\Program Files\Xtensive\DataObjects.Net\v4.6\Lib\Net40\Xtensive.Aspects.dll' because this file was explicitly added to the search path. LOG: File 'E:\Program Files\Xtensive\DataObjects.Net\v4.6\Lib\Net40\Xtensive.Aspects.dll' has identity 'xtensive.aspects, version=4.6.0.0, culture=neutral, publickeytoken=93a6c53d77a5296c, processorarchitecture=msil'. LOG: File 'E:\Program Files\Xtensive\DataObjects.Net\v4.6\Lib\Net40\Xtensive.Aspects.dll' does not match the reference. LOG: Probing location 'E:\My Documents\Visual Studio 2010\Projects\DOTest2\packages\PostSharp.2.1.7.16\tools\Release\xtensive.aspects.exe' because this directory was explicitly added to the search path. LOG: The file 'E:\My Documents\Visual Studio 2010\Projects\DOTest2\packages\PostSharp.2.1.7.16\tools\Release\xtensive.aspects.exe' could not be found. LOG: Probing location 'E:\My Documents\Visual Studio 2010\Projects\DOTest2\packages\PostSharp.2.1.7.16\tools\Release\xtensive.aspects.dll' because this directory was explicitly added to the search path. LOG: The file 'E:\My Documents\Visual Studio 2010\Projects\DOTest2\packages\PostSharp.2.1.7.16\tools\Release\xtensive.aspects.dll' could not be found. LOG: Probing location 'E:\Program Develop.Net V4.51\Projects\NetString.RDFLib\xtensive.aspects.exe' because this directory was explicitly added to the search path. LOG: The file 'E:\Program Develop.Net V4.51\Projects\NetString.RDFLib\xtensive.aspects.exe' could not be found. LOG: Probing location 'E:\Program Develop.Net V4.51\Projects\NetString.RDFLib\xtensive.aspects.dll' because this directory was explicitly added to the search path. LOG: The file 'E:\Program Develop.Net V4.51\Projects\NetString.RDFLib\xtensive.aspects.dll' could not be found. LOG: Probing location 'E:\Program Develop.Net V4.51\Projects\NetString.RDFLib\bin\Debug\xtensive.aspects.exe' because this directory was explicitly added to the search path. LOG: The file 'E:\Program Develop.Net V4.51\Projects\NetString.RDFLib\bin\Debug\xtensive.aspects.exe' could not be found. LOG: Probing location 'E:\Program Develop.Net V4.51\Projects\NetString.RDFLib\bin\Debug\xtensive.aspects.dll' because this directory was explicitly added to the search path. LOG: File 'E:\Program Develop.Net V4.51\Projects\NetString.RDFLib\bin\Debug\xtensive.aspects.dll' has identity 'xtensive.aspects, version=4.6.0.0, culture=neutral, publickeytoken=93a6c53d77a5296c, processorarchitecture=msil'. LOG: File 'E:\Program Develop.Net V4.51\Projects\NetString.RDFLib\bin\Debug\xtensive.aspects.dll' does not match the reference. LOG: Probing location 'E:\Program Develop.Net V4.51\Projects\NetString.RDFLib\obj\Debug\xtensive.aspects.exe' because this directory was explicitly added to the search path. LOG: The file 'E:\Program Develop.Net V4.51\Projects\NetString.RDFLib\obj\Debug\xtensive.aspects.exe' could not be found. LOG: Probing location 'E:\Program Develop.Net V4.51\Projects\NetString.RDFLib\obj\Debug\xtensive.aspects.dll' because this directory was explicitly added to the search path. LOG: The file 'E:\Program Develop.Net V4.51\Projects\NetString.RDFLib\obj\Debug\xtensive.aspects.dll' could not be found. LOG: Probing location 'E:\My Documents\Visual Studio 2010\Projects\DOTest2\packages\Xtensive.Orm.4.6.3\Tools\xtensive.aspects.exe' because this directory was explicitly added to the search path. LOG: The file 'E:\My Documents\Visual Studio 2010\Projects\DOTest2\packages\Xtensive.Orm.4.6.3\Tools\xtensive.aspects.exe' could not be found. LOG: Probing location 'E:\My Documents\Visual Studio 2010\Projects\DOTest2\packages\Xtensive.Orm.4.6.3\Tools\xtensive.aspects.dll' because this directory was explicitly added to the search path. LOG: File 'E:\My Documents\Visual Studio 2010\Projects\DOTest2\packages\Xtensive.Orm.4.6.3\Tools\xtensive.aspects.dll' has identity 'xtensive.aspects, version=4.6.0.0, culture=neutral, publickeytoken=93a6c53d77a5296c, processorarchitecture=msil'. LOG: File 'E:\My Documents\Visual Studio 2010\Projects\DOTest2\packages\Xtensive.Orm.4.6.3\Tools\xtensive.aspects.dll' does not match the reference. LOG: Probing location 'C:\Program Files (x86)\Reference Assemblies\Microsoft\Framework.NETFramework\v4.5.1\xtensive.aspects.exe' because this directory was explicitly added to the search path. LOG: The file 'C:\Program Files (x86)\Reference Assemblies\Microsoft\Framework.NETFramework\v4.5.1\xtensive.aspects.exe' could not be found. LOG: Probing location 'C:\Program Files (x86)\Reference Assemblies\Microsoft\Framework.NETFramework\v4.5.1\xtensive.aspects.dll' because this directory was explicitly added to the search path. LOG: The file 'C:\Program Files (x86)\Reference Assemblies\Microsoft\Framework.NETFramework\v4.5.1\xtensive.aspects.dll' could not be found. LOG: Probing location 'C:\Program Files (x86)\Reference Assemblies\Microsoft\Framework.NETFramework\v4.5.1\Facades\xtensive.aspects.exe' because this directory was explicitly added to the search path. LOG: The file 'C:\Program Files (x86)\Reference Assemblies\Microsoft\Framework.NETFramework\v4.5.1\Facades\xtensive.aspects.exe' could not be found. LOG: Probing location 'C:\Program Files (x86)\Reference Assemblies\Microsoft\Framework.NETFramework\v4.5.1\Facades\xtensive.aspects.dll' because this directory was explicitly added to the search path. LOG: The file 'C:\Program Files (x86)\Reference Assemblies\Microsoft\Framework.NETFramework\v4.5.1\Facades\xtensive.aspects.dll' could not be found. LOG: The assembly 'xtensive.aspects, version=4.6.0.0, culture=neutral, publickeytoken=93a6c53d77a5296c, processorarchitecture=x86' was not found. LOG: (ClrHost) ProvideAssembly: "xtensive.aspects, version=4.6.0.0, culture=neutral, publickeytoken=93a6c53d77a5296c, processorarchitecture=x86": file not found! LOG: (ClrHost) ProvideAssembly: "xtensive.aspects, version=4.6.0.0, culture=neutral, publickeytoken=93a6c53d77a5296c, processorarchitecture=msil". LOG: Finding the assembly with binding identity 'xtensive.aspects, version=4.6.0.0, culture=neutral, publickeytoken=93a6c53d77a5296c, processorarchitecture=msil'. LOG: Looking in GAC for xtensive.aspects, Version=4.6.0.0, Culture=neutral, PublicKeyToken=93a6c53d77a5296c, processorArchitecture=msil. LOG: Probing location 'E:\Program Files\Xtensive\DataObjects.Net\v4.6\Lib\Net40\Xtensive.Aspects.dll' because this file was explicitly added to the search path. LOG: File 'E:\Program Files\Xtensive\DataObjects.Net\v4.6\Lib\Net40\Xtensive.Aspects.dll' has identity 'xtensive.aspects, version=4.6.0.0, culture=neutral, publickeytoken=93a6c53d77a5296c, processorarchitecture=msil'. LOG: Selecting file 'E:\Program Files\Xtensive\DataObjects.Net\v4.6\Lib\Net40\Xtensive.Aspects.dll' with identity 'xtensive.aspects, version=4.6.0.0, culture=neutral, publickeytoken=93a6c53d77a5296c, processorarchitecture=msil'. LOG: (ClrHost) ProvideAssembly: "xtensive.aspects, version=4.6.0.0, culture=neutral, publickeytoken=93a6c53d77a5296c, processorarchitecture=msil": assembly found in search path. LOG: (ClrHost) ProvideAssembly: "xtensive.aspects, version=4.6.0.0, culture=neutral, publickeytoken=93a6c53d77a5296c, processorarchitecture=msil": located in "E:\Program Files\Xtensive\DataObjects.Net\v4.6\Lib\Net40\Xtensive.Aspects.dll". LOG: (ClrHost) ProvideAssembly: "xtensive.aspects, version=4.6.0.0, culture=neutral, publickeytoken=93a6c53d77a5296c, processorarchitecture=msil": returned successfully. LOG: Loading assembly {Xtensive.Orm}. LOG: NativeDotNetPlatform.LoadAssemblyFromName: Xtensive.Orm. LOG: Assembly 'Xtensive.Orm' is not yet loaded in the AppDomain. LOG: Finding the assembly with binding identity 'xtensive.orm, version=4.6.0.0, culture=neutral, publickeytoken=93a6c53d77a5296c'. LOG: Looking in GAC for Xtensive.Orm, Version=4.6.0.0, Culture=neutral, PublicKeyToken=93a6c53d77a5296c, processorArchitecture=x86. LOG: Looking in GAC for Xtensive.Orm, Version=4.6.0.0, Culture=neutral, PublicKeyToken=93a6c53d77a5296c, processorArchitecture=msil. LOG: Looking in GAC for Xtensive.Orm, Version=4.6.0.0, Culture=neutral, PublicKeyToken=93a6c53d77a5296c. LOG: Probing location 'E:\Program Files\Xtensive\DataObjects.Net\v4.6\Lib\Net40\Xtensive.Orm.dll' because this file was explicitly added to the search path. LOG: File 'E:\Program Files\Xtensive\DataObjects.Net\v4.6\Lib\Net40\Xtensive.Orm.dll' has identity 'xtensive.orm, version=4.6.0.0, culture=neutral, publickeytoken=93a6c53d77a5296c, processorarchitecture=msil'. LOG: Selecting file 'E:\Program Files\Xtensive\DataObjects.Net\v4.6\Lib\Net40\Xtensive.Orm.dll' with identity 'xtensive.orm, version=4.6.0.0, culture=neutral, publickeytoken=93a6c53d77a5296c, processorarchitecture=msil'. LOG: Invoking Assembly.Load({xtensive.orm, version=4.6.0.0, culture=neutral, publickeytoken=93a6c53d77a5296c, processorarchitecture=msil}) LOG: (ClrHost) ProvideAssembly: "xtensive.orm, version=4.6.0.0, culture=neutral, publickeytoken=93a6c53d77a5296c, processorarchitecture=msil". LOG: Finding the assembly with binding identity 'xtensive.orm, version=4.6.0.0, culture=neutral, publickeytoken=93a6c53d77a5296c, processorarchitecture=msil'. LOG: Location found from cache: 'E:\Program Files\Xtensive\DataObjects.Net\v4.6\Lib\Net40\Xtensive.Orm.dll'. LOG: (ClrHost) ProvideAssembly: "xtensive.orm, version=4.6.0.0, culture=neutral, publickeytoken=93a6c53d77a5296c, processorarchitecture=msil": assembly found in search path. LOG: (ClrHost) ProvideAssembly: "xtensive.orm, version=4.6.0.0, culture=neutral, publickeytoken=93a6c53d77a5296c, processorarchitecture=msil": located in "E:\Program Files\Xtensive\DataObjects.Net\v4.6\Lib\Net40\Xtensive.Orm.dll". LOG: (ClrHost) ProvideAssembly: "xtensive.orm, version=4.6.0.0, culture=neutral, publickeytoken=93a6c53d77a5296c, processorarchitecture=msil": returned successfully. LOG: AssemblyLoadException: Could not load file or assembly 'xtensive.orm, Version=4.6.0.0, Culture=neutral, PublicKeyToken=93a6c53d77a5296c' or one of its dependencies. This assembly is built by a runtime newer than the currently loaded runtime and cannot be loaded. LOG: Loaded: 'mscorlib, Version=2.0.0.0, Culture=neutral, PublicKeyToken=b77a5c561934e089' from 'C:\Windows\Microsoft.NET\Framework\v2.0.50727\mscorlib.dll'. LOG: Loaded: 'PostSharp.Hosting, Version=2.1.0.0, Culture=neutral, PublicKeyToken=b13fd38b8f9c99d7' from 'E:\My Documents\Visual Studio 2010\Projects\DOTest2\packages\PostSharp.2.1.7.16\tools\Release\PostSharp.Hosting.dll'. LOG: Loaded: 'System.Core, Version=3.5.0.0, Culture=neutral, PublicKeyToken=b77a5c561934e089' from 'C:\Windows\assembly\GAC_MSIL\System.Core\3.5.0.0b77a5c561934e089\System.Core.dll'. LOG: Loaded: 'System, Version=2.0.0.0, Culture=neutral, PublicKeyToken=b77a5c561934e089' from 'C:\Windows\assembly\GAC_MSIL\System\2.0.0.0b77a5c561934e089\System.dll'. LOG: Loaded: 'PostSharp.Sdk, Version=2.1.0.0, Culture=neutral, PublicKeyToken=b13fd38b8f9c99d7' from 'E:\My Documents\Visual Studio 2010\Projects\DOTest2\packages\PostSharp.2.1.7.16\tools\Release\PostSharp.Sdk.dll'. LOG: Loaded: 'PostSharp.Settings, Version=2.1.0.0, Culture=neutral, PublicKeyToken=b13fd38b8f9c99d7' from 'E:\My Documents\Visual Studio 2010\Projects\DOTest2\packages\PostSharp.2.1.7.16\tools\Release\PostSharp.Settings.dll'. LOG: Loaded: 'PostSharp, Version=2.1.0.0, Culture=neutral, PublicKeyToken=b13fd38b8f9c99d7' from 'E:\My Documents\Visual Studio 2010\Projects\DOTest2\packages\PostSharp.2.1.7.16\tools\Release\PostSharp.dll'. LOG: Loaded: 'PostSharp.Pipe, Version=2.1.0.0, Culture=neutral, PublicKeyToken=b13fd38b8f9c99d7' from 'E:\My Documents\Visual Studio 2010\Projects\DOTest2\packages\PostSharp.2.1.7.16\tools\Release\PostSharp.Pipe.dll'. LOG: Loaded: 'System.Xml, Version=2.0.0.0, Culture=neutral, PublicKeyToken=b77a5c561934e089' from 'C:\Windows\assembly\GAC_MSIL\System.Xml\2.0.0.0b77a5c561934e089\System.Xml.dll'. LOG: Loaded: 'PostSharp.Sdk.XmlSerializers, Version=2.1.0.0, Culture=neutral, PublicKeyToken=b13fd38b8f9c99d7' from 'E:\My Documents\Visual Studio 2010\Projects\DOTest2\packages\PostSharp.2.1.7.16\tools\Release\PostSharp.Sdk.XmlSerializers.dll'. LOG: Loaded: 'System.Configuration, Version=2.0.0.0, Culture=neutral, PublicKeyToken=b03f5f7f11d50a3a' from 'C:\Windows\assembly\GAC_MSIL\System.Configuration\2.0.0.0b03f5f7f11d50a3a\System.Configuration.dll'. LOG: Loaded: 'Xtensive.Aspects.Weaver, Version=4.6.0.0, Culture=neutral, PublicKeyToken=93a6c53d77a5296c' from ''. LOG: Loaded: 'System.Drawing, Version=2.0.0.0, Culture=neutral, PublicKeyToken=b03f5f7f11d50a3a' from 'C:\Windows\assembly\GAC_MSIL\System.Drawing\2.0.0.0b03f5f7f11d50a3a\System.Drawing.dll'. LOG: Loaded: 'System.Windows.Forms, Version=2.0.0.0, Culture=neutral, PublicKeyToken=b77a5c561934e089' from 'C:\Windows\assembly\GAC_MSIL\System.Windows.Forms\2.0.0.0b77a5c561934e089\System.Windows.Forms.dll'. LOG: Loaded: 'System.Management, Version=2.0.0.0, Culture=neutral, PublicKeyToken=b03f5f7f11d50a3a' from 'C:\Windows\assembly\GAC_MSIL\System.Management\2.0.0.0__b03f5f7f11d50a3a\System.Management.dll'. LOG: Loaded: 'Xtensive.Aspects, Version=4.6.0.0, Culture=neutral, PublicKeyToken=93a6c53d77a5296c' from ''. =============================================================== ---> System.BadImageFormatException: Could not load file or assembly 'xtensive.orm, Version=4.6.0.0, Culture=neutral, PublicKeyToken=93a6c53d77a5296c' or one of its dependencies. This assembly is built by a runtime newer than the currently loaded runtime and cannot be loaded. File name: 'xtensive.orm, Version=4.6.0.0, Culture=neutral, PublicKeyToken=93a6c53d77a5296c' at System.Reflection.Assembly._nLoad(AssemblyName fileName, String codeBase, Evidence assemblySecurity, Assembly locationHint, StackCrawlMark& stackMark, Boolean throwOnFileNotFound, Boolean forIntrospection) at System.Reflection.Assembly.nLoad(AssemblyName fileName, String codeBase, Evidence assemblySecurity, Assembly locationHint, StackCrawlMark& stackMark, Boolean throwOnFileNotFound, Boolean forIntrospection) at System.Reflection.Assembly.InternalLoad(AssemblyName assemblyRef, Evidence assemblySecurity, StackCrawlMark& stackMark, Boolean forIntrospection) at System.Reflection.Assembly.InternalLoad(String assemblyString, Evidence assemblySecurity, StackCrawlMark& stackMark, Boolean forIntrospection) at System.Reflection.Assembly.Load(String assemblyString, Evidence assemblySecurity) at PostSharp.Hosting.NativeDotNet20Platform.LoadAssemblyImpl(IAssemblyName assemblyName) at PostSharp.Hosting.NativeDotNetPlatform.LoadAssemblyImpl(String fileName, IAssemblyName assemblyName) at PostSharp.Hosting.NativeDotNetPlatform.LoadAssemblyFromName(IAssemblyName assemblyName) at PostSharp.Sdk.CodeModel.AssemblyLoadHelper.LoadAssemblyFromName(IAssemblyName assemblyName, Evidence assemblySecurity)

WRN: Assembly binding logging is turned OFF. To enable assembly bind failure logging, set the registry value [HKLM\Software\Microsoft\Fusion!EnableLog] (DWORD) to 1. Note: There is some performance penalty associated with assembly bind failure logging. To turn this feature off, remove the registry value [HKLM\Software\Microsoft\Fusion!EnableLog].

--- End of inner exception stack trace --- at PostSharp.Sdk.CodeModel.AssemblyLoadHelper.^sl7vYpr7(IAssemblyName _0, Exception _1, String _2) at PostSharp.Sdk.CodeModel.AssemblyLoadHelper.LoadAssemblyFromName(IAssemblyName assemblyName, Evidence assemblySecurity) at PostSharp.Sdk.CodeModel.AssemblyRefDeclaration.GetSystemAssembly() at ††† ††††‡“.††† ††††‡’.††† ††††—”(Object ) at ††† ††††‡“.††† ††††‡’.††† ††††ˆ“(AssemblyRefDeclaration ) at System.Linq.Enumerable.WhereSelectListIterator2.MoveNext() at System.Linq.Enumerable.Max[TSource](IEnumerable1 source) at ††† ††††‡“.††† ††††‡’.††† ††††ˆˆ(††† ††††ˆ‹ ) at ††† ††††‡“.††† ††††‡’.††† ††††ˆ‡() at ††† ††††‡“.††† ††††‡’..ctor(Project ) at Xtensive.Aspects.Weaver.PlugIn.Initialize() at PostSharp.Sdk.Extensibility.Task.^2coPbsfG() at PostSharp.Sdk.Extensibility.Task.^2coPbsfG(IService _0) at PostSharp.Sdk.Extensibility.TaskCollection.^7WNENwFx??0 at PostSharp.Sdk.Extensibility.TaskCollection.^uFnUq8M0.^QQJJqT0e() at ^.tbbBumCLdfI..ctor(Project project) at ^.tbbBumCLdfI.^v//X(Project _0) at PostSharp.Sdk.AspectWeaver.AspectWeaverTask.Execute() at PostSharp.Sdk.Extensibility.Project.ExecutePhase(String phase) at PostSharp.Sdk.Extensibility.Project.Execute() at PostSharp.Hosting.PostSharpObject.ExecuteProjects() at PostSharp.Hosting.PostSharpObject.InvokeProject(ProjectInvocation projectInvocation) E:\Program Develop.Net V4.51\Projects\NetString.RDFLib\POSTSHARP NetString.RDFLib

asked Nov 20 '13 at 19:55

rasxte's gravatar image

rasxte
20161617

Hello,

I have created a new project and it compiles fine, but I am getting a number runtime errors building the DO domain.

Is DO 4.63 supported under .Net 4.5.1 and IIS 8.5?

Thank you,

(Nov 21 '13 at 16:52) rasxte rasxte's gravatar image

Hi There,

Is anyone at x-tensive listening...

(Nov 22 '13 at 13:22) rasxte rasxte's gravatar image

Yes, rasxte. Could you please describe me in details what version of DataObjects.Net and PostSharp you had in your project before the upgrade to .Net 4.5.1. Could you tried to update both DataObjects.Net & PostSharp packages to the latest version after the upgrade to .Net 4.5.1?

Thanks

(Nov 22 '13 at 13:24) Dmitri Maximov Dmitri%20Maximov's gravatar image

Dmitri,

I installed new packages for DO 4.6.4 and Postsharp 2.1.7.30

I started a new project and added all my code and references. I get the following compilation error:

LOG: Probing location 'E:\Program Develop.Net V4.5.1\Projects\NetString.RDFLib\packages\PostSharp.2.1.7.30\tools\Release\xtensive.aspects.weaver.resources.exe' because this directory was explicitly added to the search path. LOG: The file 'E:\Program Develop.Net V4.5.1\Projects\NetString.RDFLib\packages\PostSharp.2.1.7.30\tools\Release\xtensive.aspects.weaver.resources.exe' could not be found.

(Nov 22 '13 at 15:56) rasxte rasxte's gravatar image

Here is more:

Error 10 Unhandled exception (2.1.7.30, 32 bit, CLR 2.0, Release): PostSharp.Sdk.CodeModel.AssemblyLoadException: Cannot load assembly Xtensive.Orm. ============ PostSharp Assembly Loading Log =================== LOG: Finding the assembly with binding identity 'system.xml, version=4.0.0.0, culture=neutral, publickeytoken=b77a5c561934e089'. LOG: Probing location 'C:\Program Files (x86)\Reference Assemblies\Microsoft\Framework.NETFramework\v4.5.1\System.Xml.dll' because this file was explicitly added to the search path.

(Nov 22 '13 at 15:58) rasxte rasxte's gravatar image

One Answer:

Hey rasxte,

The issue required some time for the investigation but now it is clear. The root of that problem is the PostSharp compiler runs under CLR 2.0 by unknown reason. More on this on PostSharp support site.

To sort out the issue, unload the project and add the following property to csproj file:

<PostSharpTargetFrameworkVersion>4.0</PostSharpTargetFrameworkVersion>

Best, Dima

answered Nov 22 '13 at 16:23

Dmitri%20Maximov's gravatar image

Dmitri Maximov
22111211

Hi Dima,

That actually worked. When are you planning to upgrade PostSharp?

Thank you,

Richard

(Nov 25 '13 at 12:11) rasxte rasxte's gravatar image

Perfect.

Actually, we are not going to upgrade PostSharp. Instead, we are moving towards being independent from it, take a look at DataObjects.Net 5.0 beta 1 announcement in our blog.

P.S. Would you mind to mark the answer as accepted so other users could find the right way of sorting out the problem? Thanks

(Nov 25 '13 at 14:07) Dmitri Maximov Dmitri%20Maximov's gravatar image
Your answer
Please start posting your answer anonymously - your answer will be saved within the current session and published after you log in or create a new account. Please try to give a substantial answer, for discussions, please use comments and please do remember to vote (after you log in)!
toggle preview

Subscription:

Once you sign in you will be able to subscribe for any updates here

Tags:

×2

Asked: Nov 20 '13 at 19:55

Seen: 6,506 times

Last updated: Nov 25 '13 at 14:07

powered by OSQA